
=====================================================
🔨 Building FikoYT WASM Module (Release)
=====================================================

📦 Building WASM module...
[INFO]: Checking for the Wasm target...
[INFO]: Compiling to Wasm...
error: The wasm32-unknown-unknown targets are not supported by default; you may need to enable the "wasm_js" configuration flag. Note that enabling the `wasm_js` feature flag alone is insufficient. For more information see: https://docs.rs/getrandom/0.3.4/#webassembly-support
   --> C:\Users\FikoYT\.cargo\registry\src\index.crates.io-1949cf8c6b5b557f\getrandom-0.3.4\src\backends.rs:194:17
    |
194 | /                 compile_error!(concat!(
195 | |                     "The wasm32-unknown-unknown targets are not supported by default; \
196 | |                     you may need to enable the \"wasm_js\" configuration flag. Note \
197 | |                     that enabling the `wasm_js` feature flag alone is insufficient. \
198 | |                     For more information see: \
199 | |                     https://docs.rs/getrandom/", env!("CARGO_PKG_VERSION"), "/#webassembly-support"
200 | |                 ));
    | |__________________^

error[E0425]: cannot find function `fill_inner` in module `backends`
  --> C:\Users\FikoYT\.cargo\registry\src\index.crates.io-1949cf8c6b5b557f\getrandom-0.3.4\src\lib.rs:99:19
   |
99 |         backends::fill_inner(dest)?;
   |                   ^^^^^^^^^^ not found in `backends`

error[E0425]: cannot find function `inner_u32` in module `backends`
   --> C:\Users\FikoYT\.cargo\registry\src\index.crates.io-1949cf8c6b5b557f\getrandom-0.3.4\src\lib.rs:123:15
    |
123 |     backends::inner_u32()
    |               ^^^^^^^^^ not found in `backends`
    |
help: consider importing this function
    |
 33 + use crate::util::inner_u32;
    |
help: if you import `inner_u32`, refer to it directly
    |
123 -     backends::inner_u32()
123 +     inner_u32()
    |

error[E0425]: cannot find function `inner_u64` in module `backends`
   --> C:\Users\FikoYT\.cargo\registry\src\index.crates.io-1949cf8c6b5b557f\getrandom-0.3.4\src\lib.rs:137:15
    |
137 |     backends::inner_u64()
    |               ^^^^^^^^^ not found in `backends`
    |
help: consider importing this function
    |
 33 + use crate::util::inner_u64;
    |
help: if you import `inner_u64`, refer to it directly
    |
137 -     backends::inner_u64()
137 +     inner_u64()
    |

For more information about this error, try `rustc --explain E0425`.
error: could not compile `getrandom` (lib) due to 4 previous errors
Error: Compiling your crate to WebAssembly failed
Caused by: Compiling your crate to WebAssembly failed
Caused by: failed to execute `cargo build`: exited with exit code: 101
  full command: "cargo" "build" "--lib" "--release" "--target" "wasm32-unknown-unknown" "--quiet"
❌ Build failed
Press any key to continue . . . 
